{"text_format":"1","workbook":"xlsx","n_sheets":5,"sheets":["Skráning","Eyðublað - (Á)hættumat","Gagnabanki - (Á)hættumat","Banki","Áhættufylki"],"not_rendered":{"charts":0,"images":5,"macros":1,"external_links":0,"defined_names":15,"comments":3,"pivot_tables":0},"unopened":[],"bounds":{"document_bytes":16777216,"sheet_cells":100000,"rows_first":2000,"rows_last":500,"rows_between":2000,"halvings":0,"cell_chars":16384,"cell_head_chars":4096},"cells_cut":0,"cells_raw":0,"read":"whole","date_system":"1900"}

{"sheet":"Skráning","index":0,"n_rows":82,"n_cols":22,"rows_kept":82,"cut":false,"hidden":false,"merged":[[35,6,35,7],[36,6,36,7],[13,6,18,7],[21,6,33,7],[6,6,6,7],[12,6,12,7],[20,6,20,7],[3,6,3,7],[4,6,4,7],[9,6,9,7],[7,6,7,7],[10,6,10,7]]}
[null,null,null,null,null,null,null,null,null,null,null,null,{"$f":"IF(Nýrverkþáttur<>\"\",Nýrverkþáttur,verkþattur)","v":0},{"$f":"+VLOOKUP(O1,C:D,2,0)","v":{"$error":"#N/A"}},null,{"$f":"+Afleiðingar","v":""},null,{"$f":"+Aðgerðir","v":""},{"$f":"+Ábyrgðaraðili","v":0},"?","?",{"$f":"INDEX(Áhættufylki!$D$6:$H$10,MATCH(U1,Áhættufylki!$C$6:$C$10),MATCH(T1,Áhættufylki!$D$5:$H$5))","v":{"$error":"#N/A"}}]
[]
[null,"Hættuflokkur","Hætta","Column1"]
[null,"Aðskotahlutir","Starfsmaður fær hlut/agnir í sig þegar hlutur/efni skýst í hann",{"$f":"+Table2[[#This Row],[Hættuflokkur]]","v":"Aðskotahlutir"},null,null,"VERKÞÁTTUR"]
[null,"Árekstur","1. Starfsmaður verður fyrir vinnuvél eða hluta af vinnuvél\n2. Vegfarandi verður fyrir vinnuvél eða hluta af vinnuvél",{"$f":"+Table2[[#This Row],[Hættuflokkur]]","v":"Árekstur"}]
[null,"Árekstur","Starfsmaður lendir í árekstri ",{"$f":"+Table2[[#This Row],[Hættuflokkur]]","v":"Árekstur"}]
[null,"Árekstur","Starfsmaður verður fyrir ökutæki",{"$f":"+Table2[[#This Row],[Hættuflokkur]]","v":"Árekstur"},null,null,"HÆTTA"]
[null,"Árekstur","Almennir vegfarendur verða fyrir ökutæki fyrirtækisins.",{"$f":"+Table2[[#This Row],[Hættuflokkur]]","v":"Árekstur"}]
[null,"Breytingar","Aukin hætta á að starfsmaður verði fyrir slysi vegna breyttra aðstæðna",{"$f":"+Table2[[#This Row],[Hættuflokkur]]","v":"Breytingar"}]
[null,"Bruni / sprenging","Starfsmaður brennist á heitu vatni",{"$f":"+Table2[[#This Row],[Hættuflokkur]]","v":"Bruni / sprenging"},null,null,"ATBURÐUR"]
[null,"Bruni / sprenging","Starfsmaður brennist á heitri gufu",{"$f":"+Table2[[#This Row],[Hættuflokkur]]","v":"Bruni / sprenging"},null,null,{"$f":"IF(O1=\"\",\"\",O1)","v":""}]
[null,"Bruni / sprenging","Starfsmaður brennist á heitum lögnum",{"$f":"+Table2[[#This Row],[Hættuflokkur]]","v":"Bruni / sprenging"}]
[null,"Bruni / sprenging","Starfsmaður brennist / sprenging vegna varasamra efna t.d. lútur, sýrur (rafgeymar) lífræn leysiefni",{"$f":"+Table2[[#This Row],[Hættuflokkur]]","v":"Bruni / sprenging"},null,null,"ORSAKIR"]
[null,"Bruni / sprenging","Starfsmaður verður fyrir sprengingu vegna vinnuumhverfis",{"$f":"+Table2[[#This Row],[Hættuflokkur]]","v":"Bruni / sprenging"},null,null,{"$f":"+IFERROR(VLOOKUP(O1,Banki!C:D,2,0),\"\")","v":""}]
[null,"Bruni / sprenging","Starfsmaður brennist á hitagjafa (logsuða, málmsuða, rafsuða)",{"$f":"+Table2[[#This Row],[Hættuflokkur]]","v":"Bruni / sprenging"}]
[null,"Fall/hrun","Starfsmaður fellur í stiga eða tröppu",{"$f":"+Table2[[#This Row],[Hættuflokkur]]","v":"Fall/hrun"}]
[null,"Fall/hrun","Starfmaður fellur af vinnufalli",{"$f":"+Table2[[#This Row],[Hættuflokkur]]","v":"Fall/hrun"}]
[null,"Fall/hrun","Starfsmaður fellur úr staur",{"$f":"+Table2[[#This Row],[Hættuflokkur]]","v":"Fall/hrun"}]
[null,"Fall/hrun","Starfsmaður fellur úr vinnulyftu/spjóti eða mannkörfu",{"$f":"+Table2[[#This Row],[Hættuflokkur]]","v":"Fall/hrun"}]
[null,"Fall/hrun","Starfsmaður fellur frá brún eða kanti",{"$f":"+Table2[[#This Row],[Hættuflokkur]]","v":"Fall/hrun"}]
{"$rows_left_out":63}
{"sheet":"Eyðublað - (Á)hættumat","index":1,"n_rows":4,"n_cols":11,"rows_kept":4,"cut":false,"hidden":false,"merged":[]}
["VERK: ",null,"Þátttakendur við gerð hættumats:"]
["Fyrirtæki: ","Landsnet","Dagsetning:",{"$f":"NOW()","v":"2022-06-02T09:13:41.530"}]
[]
["VERKÞÁTTUR","HÆTTA","ATBURÐUR","ORSAKIR","ÁHÆTTUSTIG fyrir stýringu","RÁÐSTAFANIR","ÁBYRGÐ","AFLEIÐINGAR","LÍKUR","ÁHÆTTUSTIG","FREKARI RÁÐSTAFANIR"]

{"sheet":"Gagnabanki - (Á)hættumat","index":2,"n_rows":54,"n_cols":8,"rows_kept":54,"cut":false,"hidden":true,"merged":[]}
[]
[null,"VERK: ",null,null,"Þátttakendur við gerð áhættumats:","Hlín Benediktsdóttir og Bjarni Reyr "]
[null,null,null,null,"Dagsetning:","2014-02-12"]
[]
[null,"Verkþáttur","Hættuflokkur","Hætta","Stutt lýsing á hættunni/ástæður hættunnar","Ráðstafanir","Ábyrgð","Leit"]
[null,null,"Fallhætta/hrunhætta","fall úr stigum/tröppum","1. Stigi/trappa gefur sig                                             2.Starfsmaður missir jafnvægið                                                     3. Stigi/trappa rennur/fellur","1. Nota viðurkennda stiga/tröppur skv. ÍST EN 131 . Sjónskoða stiga/tröppur fyrir hverja notkun.\n2. Viðhalda þriggja punkta gripi og snúa að stiga. Meta skal aðstæður hverju sinni m.t.t. veðurskilyrða.  \n3. Skoða undirlag, tryggja að það sé þétt og slétt. Stilla stiga upp með halla 1:4 og stigi nái 1m upp fyrir brún. Festa stiga efst eða halda við stigann. Stíga ekki í efsta þrep í tröppum\n",null,{"$f":"+Table10[[#This Row],[Hættuflokkur]]","v":"Fallhætta/hrunhætta"}]
[null,null,"Fallhætta/hrunhætta","fall úr vinnupöllum","Vinnupallur gefur sig og/eða vinnupallur ekki uppsettur á fullnægjandi hátt.","Vinnupallar skulu vera af viðurkenndri gerð og reistir skv. Ísl. Reglugerðum af fagaðila. Hafa skal í huga að uppfylla skilyrði um varnir á vinnupöllum. Til staðar sé handlisti (1m), hnélisti (0,5m) og fótlisti (0,15m). Festa lóðrétta stiga uppi, niðri og a.m.k. með 3 metra millibili. Trévinnupallar skulu teknir út af Vinnueftirliti Ríkisins fyrir fyrstu notkun. Sjónskoða vinnupalla fyrir hverja notkun.",null,{"$f":"+Table10[[#This Row],[Hættuflokkur]]","v":"Fallhætta/hrunhætta"}]
[null,null,"Fallhætta/hrunhætta","fall úr staurum","1. Staur gefur sig - \n2. Starfsmaður missir jafnvægið\n","1. Þar sem því er viðkomið skal nota vinnulyftu eða mannkörfu við vinnu í loftlínu. Ástandsmeta staur áður en hann er klifinn m.t.t. styrks, stöðugleika og ísingar. Nota viðurkenndan klifur og fallvarnarbúnað. \n2. Starfsmaður skal hafa hlotið fallvarna og loftlínu þjálfun áður en vinna hefst. Meta skal aðstæður hverju sinni m.t.t. veðurskilyrða. Björgunaráætlun skal vera til staðar áður en verk ef framkvæmt.\n",null,{"$f":"+Table10[[#This Row],[Hættuflokkur]]","v":"Fallhætta/hrunhætta"}]
[null,null,"Fallhætta/hrunhætta","fall úr vinnulyftum eða mannkörfum","Lyfta/spjót gefur sig","Nota viðurkenndan klifur og fallvarnarbúnað. Starfsmaður skal hafa hlotið fallvarna og loftlínu þjálfun áður en vinna hefst. Meta skal aðstæður hverju sinni m.t.t. veðurskilyrða. Björgunaráætlun skal til staðar áður en verk ef framkvæmt.",null,{"$f":"+Table10[[#This Row],[Hættuflokkur]]","v":"Fallhætta/hrunhætta"}]
[null,null,"Fallhætta/hrunhætta","fall frá brúnum/könntum (í hæð)","Starfsmaður missir jafnvægið","Halda 2m fjarlægð frá brún. Handrið skal sett ef ekki er hægt að tryggja 2m fjarlægð frá brún. Nota skal fallvarnarbúnað ef hvorki er hægt að halda 2m fjarlægð eða handrið til staðar. Nota viðurkenndan fallvarnarbúnað. Starfsmaður skal hafa hlotið fallvarna þjálfun áður en vinna hefst. Meta skal aðstæður hverju sinni m.t.t. veðurskilyrða. Björgunaráætlun skal til staðar áður en verk ef framkvæmt.",null,{"$f":"+Table10[[#This Row],[Hættuflokkur]]","v":"Fallhætta/hrunhætta"}]
[null,null,"Fallhætta/hrunhætta","fall í gryfjur/skurði","1. Brún gefur sig\n2. Starfsmaður missir jafnvægið\n3. Vegfarandi fellur í skuð\n","1. Flái/halli skal vera skv. reglum og leiðbeiningum frá vinnueftirlitinu og þeim upplýsingum sem koma fram á útgefnum teikningum. Huga skal að veðurbreytingum (frost/þíða) og gera þær ráðstafanir sem þarf til að sporna við hættuástandi.\n2. Ekki skal standa/ganga nálægt gryfju/skurðbrún. Tryggja örugga gönguleið og örugga göngubrú þar sem við á, hafa þær hreinar og greiðfærar. Göngubrýrnar skulu vera með handriði í 50cm og 1m hæð frá gólfi báðum megin á brúnni. Brúin skal ná xx cm út fyrir skurðbrún báðu megin við skurðinn á tryggu undirlagi.\n3. Séu girðingar og merkingar hannaðar fyrir verk: Fara skal eftir útgefnum teikningum og verklýsingum varðandi girðingar og merkingar frá hönnuðum                              \n3. Séu girðingar ekki sérhannaðar fyrir verk: Girða af vinnusvæði og merkja m.t.t. aðstæðna skv. reglum um Merkingu vinnusvæða og Reglur um vinnusvæðamerkingar. Fyrir öll verk gildir: Tryggja örugga gönguleið og örugga göngubrú þar sem við á, hafa þær hreinar og greiðfærar. Göngubrýrnar skulu vera með handriði í 50cm og 1m hæð frá gólfi báðum megin á brúnni. Brúin skal ná xx cm út fyrir skurðbrún báðu megin við skurðinn á tryggu undirlagi.Viðhalda merkingum og girðingum á meðan á verktíma stendur. Yfirfara þarf bæði merkingar og girðingar í lok vinnudags. Sérstaklega skal ganga frá vel um vetrartíma og þar sem illa sést til.   \n",null,{"$f":"+Table10[[#This Row],[Hættuflokkur]]","v":"Fallhætta/hrunhætta"}]
[null,null,"Fallhætta/hrunhætta","fall á janfsléttu","Starfsmaður missir jafnvægið","Halda vinnusvæðinu hreinu. Tryggja örugga og slétta gönguleiðir um vinnusvæðið. Huga skal að veðurbreytingum (hálka, snjór, rigning) og bregðast þannig við þeim að starfsmaður sé ekki í hættu á vinnusvæðinu. ",null,{"$f":"+Table10[[#This Row],[Hættuflokkur]]","v":"Fallhætta/hrunhætta"}]
[null,null,"Fallhætta/hrunhætta","hrun frá skurðbrúnum (efni)","Brún gefur sig ","Flái/halli skal vera skv. reglum og leiðbeiningum frá vinnueftirlitinu og þeim upplýsingum sem koma fram á útgefnum teikningum. Huga skal að veðurbreytingum (frost/þíða) og gera þær ráðstafanir sem þarf til að sporna við hættuástandi. Koma í veg fyrir að þungir hlutir hvíli á bakka. Efni skal vera a.m.k. 1m frá skurðbrún. Vélar og tæki skulu vera sem fjærst skurðbrún. ",null,{"$f":"+Table10[[#This Row],[Hættuflokkur]]","v":"Fallhætta/hrunhætta"}]
[null,null,"Fallhætta/hrunhætta","hrun/ fallandi hlutir eða efni","1. Lausir hlutir/verkfæri/efni of nálægt brún.\n2. Starfsmaður missir hlutir/verkfæri/efni\n3. Hlass fellur úr lyftibúnaði\n4. Hlass fellur úr gröfu, bílfarmi\n","1. Halda hlutum/verkfærum/efni sem fjærst brún. Setja upp táborð á vinnupöllum.  \n2. Tryggja/girða af svæðið fyrir neðan.\n3. Tryggja/girða af svæðið fyrir neðan. Nota viðurkenndan hífingarbúnað.Starfsmaður skal hafa hlotið viðunnandi þjálfun áður en vinna hefst. Meta skal aðstæður hverju sinni m.t.t. veðurskilyrða.\n4. Starfsmaður skal halda sig a.m.k. Xx m frá vinnuvélum\n",null,{"$f":"+Table10[[#This Row],[Hættuflokkur]]","v":"Fallhætta/hrunhætta"}]
[null,null,"Klemmihætta","Vegna handverkfæra","Starfsmaður klemmir sig vegna rangrar notkunar / beitingar verkfæra / ónýt eða léleg verkefæri","Yfirfara verkfæri áður en þau eru notuð, sjónskoða. Hlífar og öryggisbúnaður sé til staðar og í lagi á tækinu. Taka biluð/óörugg tæki úr umferð. Verkfæri teljast ekki nohæf ef öryggishlífar virka ekki. Séu vekfæri of þung skal notast við léttitæki eða fá aðstoð.",null,{"$f":"+Table10[[#This Row],[Hættuflokkur]]","v":"Klemmihætta"}]
[null,null,"Klemmihætta","Vegna vélbúnaðar","Verða fyrir hreyfanlegum hlutum vélbúnaðarins","Tryggja að öryggihlífar og öryggisbúnaður séu á búnaði. Tryggja rétta notkun á tækinu sbr. leiðbeininga framleiðanda og/eða verklagsreglum um notkun tækis.  Taka bilaðan/óöruggan vélbúnað úr umferð. (Notast við aðvörunarmerkingar ef ekki er hægt að fjarlægja búnað)",null,{"$f":"+Table10[[#This Row],[Hættuflokkur]]","v":"Klemmihætta"}]
[null,null,"Klemmihætta","Vegna hluta (aðföng, hurð, hleri)","1. Starfsmaður verður á mili hluta t.d. hurða, hlera.\n2. Starfsmaður verður á mili hlutar sem að hann er að bera og fyrirstöðu\n"," 1. Nota viðeigandi öryggisbúnað eða tryggja festingu.\n2. Nota léttitæki. Fá aðstoð við fluttning. Kanna aðstæður, fjarlægja hindranir. Hafa hendur utan skotlínu. Nota hanska.\n",null,{"$f":"+Table10[[#This Row],[Hættuflokkur]]","v":"Klemmihætta"}]
[null,null,"Klemmihætta","Vegna hífibúnaðar/hlass","Verða á milli ásláttarbúnaðar (stroffu) og hlass eða milli hlass og fyrirstöðu","Standa utan skotlínu. Stroffur skulu vera skoðaðar fyrir notkun. Tryggja skýr samskipti við kranamann. Nota stýrilínur og snerta ekki hlass. Afmarka vinnusvæð. Nota hanska.",null,{"$f":"+Table10[[#This Row],[Hættuflokkur]]","v":"Klemmihætta"}]
[null,null,"Klemmihætta","Vegna vinnuvéla","Starfsmaður verður fyrir höggi eða klemmist vegna vinnuvéla","Starfsmaður skal halda sig a.m.k. 3 m frá vinnuvélum",null,{"$f":"+Table10[[#This Row],[Hættuflokkur]]","v":"Klemmihætta"}]
[null,null,"Klemmihætta","Vegna umferðar","1. Árekstur í umferð\n2. Starfsmaður verður fyrir ökutæki\n3. Almennir vegfarendur -ökutæki-ökutæki /vegfarendur -ökutæki rekast saman.\n","1. Aka eftir aðstæðum, nota öryggisbelti og virða umferðareglur. Notkun farsíma er óheimil við akstur.\n2. Óafgirt vinnusvæði: Leggja bíl þannig að hann skýli gegn aðsteðjandi umferð, nota blikkljós, klæðast sýnileikafatnaði.                                                                 \n2. Afgirt vinnusvæði: Aðgreina vel vinnusvæði skv. MERKINGAR VINNUSVÆÐA & REGLUR UM VINNUSTVÆÐAMERKINGAR og útgefnum teikningum og verklýsingu ef þær eru til staðar. Búa til gönguleiðir og afmarka vel vinnusvæði svo gangandi starfsmenn séu ekki í hættu.\n3. Séu girðingar og merkingar ekki hannaðar: Ganga frá vinnusvæði og merkingum eins og segir til um í MERKINGAR VINNUSVÆÐA & REGLUR UM VINNUSTVÆÐAMERKINGAR.                                             \n3. Séu giðingar og merkingar hannaðar: Fara eftir útgefnum teikningum og verklýsingu varðandi girðingar og merkingar.                                                                              \n3. Fyrir öll verk gildir: Viðhalda merkingum og girðingum á meðan á verktíma stendur. Yfirfara þarf bæði merkingar og girðingar í lok vinnudags. Sérstaklega skal ganga frá vel um vetrartíma og þar sem illa sést til.\n",null,{"$f":"+Table10[[#This Row],[Hættuflokkur]]","v":"Klemmihætta"}]
{"$rows_left_out":35}
{"sheet":"Banki","index":3,"n_rows":82,"n_cols":7,"rows_kept":82,"cut":false,"hidden":false,"merged":[]}
[]
["VERKÞÁTTUR","HÆTTA","ATBURÐUR","ORSAKIR","Ráðstafanir","Column1","HÆTTA2"]
[null,"Fall/hrun","Starfsmaður fellur í stiga eða tröppu","1  Stigi/trappa gefur sig/brotnar \n2. Skrikar fótur                                                                                             3 Stigi/trappa rennur/fellur vegna undirlags","1. Nota viðurkennda stiga/tröppur skv. ÍST EN 131 . Sjónskoða stiga/tröppur fyrir hverja notkun.\n2. Viðhalda þriggja punkta gripi og snúa að stiga. Meta skal aðstæður hverju sinni m.t.t. veðurskilyrða.  \n3. Skoða undirlag, tryggja að það sé þétt og slétt. Stilla stiga upp með halla 1:4 og stigi nái 1m upp fyrir brún. Festa stiga efst eða halda við stigann. Stíga ekki í efsta þrep í tröppum\n",null,{"$f":"+Banki!$B3","v":"Fall/hrun"}]
[null,"Fall/hrun","Starfmaður fellur af vinnufalli","Vinnupallur gefur sig og/eða vinnupallur ekki uppsettur á fullnægjandi hátt.","Vinnupallar skulu vera af viðurkenndri gerð og reistir skv. Ísl. Reglugerðum af fagaðila. Hafa skal í huga að uppfylla skilyrði um varnir á vinnupöllum. Til staðar sé handlisti (1m), hnélisti (0,5m) og fótlisti (0,15m). Festa lóðrétta stiga uppi, niðri og a.m.k. með 3 metra millibili. Trévinnupallar skulu teknir út af Vinnueftirliti Ríkisins fyrir fyrstu notkun. Sjónskoða vinnupalla fyrir hverja notkun.",null,{"$f":"+Banki!$B4","v":"Fall/hrun"}]
[null,"Fall/hrun","Starfsmaður fellur úr staur","1. Staur gefur sig  \n2. Starfsmaður missir jafnvægið\n","1. Þar sem því er viðkomið skal nota vinnulyftu eða mannkörfu við vinnu í loftlínu. Ástandsmeta staur áður en hann er klifinn m.t.t. styrks, stöðugleika og ísingar. Nota viðurkenndan klifur og fallvarnarbúnað. \n2. Starfsmaður skal hafa hlotið fallvarna og loftlínu þjálfun áður en vinna hefst. Meta skal aðstæður hverju sinni m.t.t. veðurskilyrða. Starfsmaður á jörðu niðri fylgist með og hefur tiltæka björgunaráætlun sem ákveðin er í sameiningu fyrir verk. \n",null,{"$f":"+Banki!$B5","v":"Fall/hrun"}]
[null,"Fall/hrun","Starfsmaður fellur úr vinnulyftu/spjóti eða mannkörfu","1. Lyfta/spjót/mann karfa gefur sig.\n2. Keyrt er á vinnulyftu eða spjót\n3. Starfsmaður teygir sig of langt út fyrir","1. Nota viðurkenndan klifur og fallvarnarbúnað. Starfsmaður skal hafa hlotið fallvarna og loftlínu þjálfun áður en vinna hefst. Meta skal aðstæður hverju sinni m.t.t. veðurskilyrða. Björgunaráætlun skal til staðar áður en verk ef framkvæmt.\n2. Girða af vinnusvæði\n3. Færa körfu eftir þörfum",null,{"$f":"+Banki!$B6","v":"Fall/hrun"}]
[null,"Fall/hrun","Starfsmaður fellur frá brún eða kanti","1. Starfsmaður missir jafnvægið\n2. Starfmaður fellur um verkfæri/jarðveg","1. Halda 2m fjarlægð frá brún. Handrið skal sett ef ekki er hægt að tryggja 2m fjarlægð frá brún. Nota skal fallvarnarbúnað eða taumhaldslínu ef hvorki er hægt að halda 2m fjarlægð eða handrið til staðar. Nota viðurkenndan fallvarnarbúnað. Starfsmaður skal hafa hlotið fallvarna þjálfun áður en vinna hefst. Meta skal aðstæður hverju sinni m.t.t. veðurskilyrða. Björgunaráætlun skal til staðar áður en verk ef framkvæmt.\n2. Halda vinnusvæði hreinu og fjarlægja jarðveg ef hægt er.",null,{"$f":"+Banki!$B7","v":"Fall/hrun"}]
[null,"Fall/hrun","Starfsmaður/vegfarandi fellur í gryfju eða skurð","1. Brún gefur sig\n2. Starfsmaður missir jafnvægið\n\n","1. Flái/halli skal vera skv. reglum og leiðbeiningum frá vinnueftirlitinu og þeim upplýsingum sem koma fram á útgefnum teikningum. Huga skal að veðurbreytingum (frost/þíða) og gera þær ráðstafanir sem þarf til að sporna við hættuástandi.\n2. Ekki skal standa/ganga nálægt gryfju/skurðbrún. Tryggja örugga gönguleið og örugga göngubrú þar sem við á, hafa þær hreinar og greiðfærar. Göngubrýrnar skulu vera með handriði í 50cm og 1m hæð frá gólfi báðum megin á brúnni. Brúin skal standa á tryggu undirlagi beggja vegna skurðbakkana xx cm út fyrir skurðbrún báðu megin við skurðinn á tryggu undirlagi.\n2. Séu girðingar og merkingar hannaðar fyrir verk: Fara skal eftir útgefnum teikningum og verklýsingum varðandi girðingar og merkingar frá hönnuðum                              \n2. Séu girðingar ekki sérhannaðar fyrir verk: Girða af vinnusvæði og merkja m.t.t. aðstæðna skv. reglum um Merkingu vinnusvæða og Reglur um vinnusvæðamerkingar. Fyrir öll verk gildir: Tryggja örugga gönguleið og örugga göngubrú þar sem við á, hafa þær hreinar og greiðfærar. Göngubrýrnar skulu vera með handriði í 50cm og 1m hæð frá gólfi báðum megin á brúnni. Brúin skal ná xx cm út fyrir skurðbrún báðu megin við skurðinn á tryggu undirlagi.Viðhalda merkingum og girðingum á meðan á verktíma stendur. Yfirfara þarf bæði merkingar og girðingar í lok vinnudags. Sérstaklega skal ganga frá vel um vetrartíma og þar sem illa sést til.   \n",null,{"$f":"+Banki!$B8","v":"Fall/hrun"}]
[null,"Fall/hrun","Starfsmaður fellur á jafnsléttu","1. Starfsmaður missir jafnvægið\n2. Starfmaður fellur um verkfæri/jarðveg","1. Tryggja örugga og slétta gönguleiðir um vinnusvæðið. Huga skal að veðurbreytingum (hálka, snjór, rigning) og bregðast þannig við þeim að starfsmaður sé ekki í hættu á vinnusvæðinu. \n2. Halda vinnusvæðinu hreinu. ",null,{"$f":"+Banki!$B9","v":"Fall/hrun"}]
[null,"Fall/hrun","Starfsmaður fær yfir sig efni frá skurðbrúnum","1. Brún gefur sig \n2. Þung tæki of lægt brún","1. Flái/halli skal vera skv. reglum og leiðbeiningum frá vinnueftirlitinu og þeim upplýsingum sem koma fram á útgefnum teikningum. Huga skal að veðurbreytingum (frost/þíða) og gera þær ráðstafanir sem þarf til að sporna við hættuástandi. Koma í veg fyrir að þungir hlutir hvíli á bakka. Efni skal vera a.m.k. 1m frá skurðbrún. \n2. Vélar og tæki skulu vera sem fjærst skurðbrún. ",null,{"$f":"+Banki!$B10","v":"Fall/hrun"}]
[null,"Fall/hrun","Starfsmaður fær í sig verkfæri eða yfir sig efni. ","1. Lausir hlutir/verkfæri/efni of nálægt brún.\n2. Starfsmaður við vinnu fyrir ofan missir hlutir/verkfæri/efni\n\n","1. Halda hlutum/verkfærum/efni sem fjærst brún. Setja upp táborð á vinnupöllum.  \n2. Tryggja/girða af svæðið fyrir neðan.\n\n",null,{"$f":"+Banki!$B11","v":"Fall/hrun"}]
[null,"Fall/hrun","Starfsmaður fær yfir sig hlass við hífingu","1. Starfsmaður stendur innan skotlínu\n2. Stroffa eða annar hífibúnaður gefur sig\n3. Blökk eða vír gefur sig \n4. Misskilningur í samskiptum\n","1. Standa utan skotlínu. Nota stýrilínur og snerta ekki hlass. Afmarka vinnusvæði\n2. Stroffur og annar hífibúnaður skulu vera skoðaðar fyrir notkun. Nota viðurkenndan hífingarbúnað\n3. Fyrirbyggjandi viðhald á blökk og vír\n4.  Tryggja skýr samskipti við kranamann. Starfsmaður skal hafa hlotið viðunnandi þjálfun áður en vinna hefst\n",null,{"$f":"+Banki!$B12","v":"Fall/hrun"}]
[null,"Fall/hrun","Starfsmaður fær yfir sig hlass úr gröfu","1. Mistök/misskilningur í samskiptum\n2. Búnaður bilar","1: Skýr samskipti milli aðila. Starfsmaður skal halda sig a.m.k. 3 metra frá vinnuvélum\n2. Sjónskoða vinnuvél (skoðanamiði)",null,{"$f":"+Banki!$B13","v":"Fall/hrun"}]
[null,"Klemma","Starfsmaður klemmir sig á handverkfæri","Röng notkun / beiting verkfæra / ónýt eða léleg verkfæri","Yfirfara verkfæri áður en þau eru notuð, sjónskoða. Hlífar og öryggisbúnaður sé til staðar og í lagi á verkfærinu. Taka biluð/óörugg verkfæri úr umferð. Séu verkfæri of þung skal notast við léttitæki eða fá aðstoð.",null,{"$f":"+Banki!$B14","v":"Klemma"}]
[null,"Klemma","Starfsmaður verður fyrir hreyfanlegum hlutum vélbúnaðarins","1. Í skotlínu\n2. Öryggishlífar fjarlægðar\n3. Flaksandi hár eða föt/hlutir","1. Halda sér/útlimum utan skotlínu\n2. Tryggja að öryggishlífar og öryggisbúnaður séu á búnaði. Tryggja rétta notkun á tækinu sbr. leiðbeininga framleiðanda og/eða verklagsreglum um notkun tækis.  Taka bilaðan/óöruggan vélbúnað úr umferð. (Notast við aðvörunarmerkingar ef ekki er hægt að fjarlægja búnað)\n3. Tryggja að hár/föt/hlutir flækist ekki í búnaði",null,{"$f":"+Banki!$B15","v":"Klemma"}]
[null,"Klemma","Starfsmaður klemmist á milli hluta (t.d. hurð, hleri).","Hlutir á ferð (lokast, skellast - dragsúgur)","Nota viðeigandi öryggisbúnað eða tryggja festingu.\n\n",null,{"$f":"+Banki!$B16","v":"Klemma"}]
[null,"Klemma","Starfsmaður klemmist á milli hluta sem hann er að bera og fyrirstöðu"," Þungir hlutir, aðskotahlutir","Nota léttitæki. Fá aðstoð við flutning. Kanna aðstæður, fjarlægja hindranir. Hafa hendur utan skotlínu. Nota hanska.\n",null,{"$f":"+Banki!$B17","v":"Klemma"}]
[null,"Klemma","Starfsmaður klemmist á  milli ásláttarbúnaðar (stroffu/keðju) og fyrirstöðu","1. Hendur í skotlínu\n2. Misskilningur í samskiptum","1. Hendur utan skotlínu. Stroffur skulu vera skoðaðar fyrir notkun.  Nota hanska.\n2. Tryggja skýr samskipti við kranamann. ",null,{"$f":"+Banki!$B18","v":"Klemma"}]
[null,"Klemma","Starfsmaður verður fyrir höggi eða klemmist vegna vinnuvéla","1. Stendur í skotlínu\n2. Misskilningur í samskiptum","1. Starfsmaður skal halda sig a.m.k. 3 m frá vinnuvélum\n2. Tryggja skýr samskipti við kranamann. ",null,{"$f":"+Banki!$B19","v":"Klemma"}]
[null,"Hávaði","Starfsmaður verður fyrir heyrnaskemmd","Vinna í umhverfi þar sem meðaltalshávaði er yfir 85 dB á 8 klst. vinnudegi og/eða þar sem hávaðatoppar fara í 110 dB eða meira.","Útiloka/draga úr hávaðavaldi. Koma í veg fyrir óþarfa skelli.  Takmarka viðveru starfsmanns í hávaðasömu umhverfi. Nota heyrnahlífar/eyrnatappa.  Virða skal merkingar um heyrnahlífanotkun. Athuga að hættumörk breytileg eftir lengd vaktar.",null,{"$f":"+Banki!$B20","v":"Hávaði"}]
{"$rows_left_out":63}
{"sheet":"Áhættufylki","index":4,"n_rows":34,"n_cols":16,"rows_kept":34,"cut":false,"hidden":false,"merged":[]}
[]
[]
[]
[]
[null,null,"?","1. Minniháttar","2. Miðlungs","3. Alvarlegar","4. Meiriháttar","5. Stóralvarlegar"]
[null,null,"A - Nánast víst","Nokkur","Töluverð","Mikil","Mikil","Mikil"]
[null,null,"B - Líklegt","Nokkur","Töluverð","Töluverð","Mikil","Mikil"]
[null,null,"C - Hugsanlegt","Lítil","Nokkur","Töluverð","Mikil","Mikil"]
[null,null,"D - Ólíklegt","Lítil","Lítil","Nokkur","Töluverð","Mikil"]
[null,null,"E - Sjaldgæft","Lítil","Lítil","Nokkur","Töluverð","Töluverð"]
[]
[]
[]
[]
[]
[]
[]
[]
[]
[]
{"$rows_left_out":14}